Re: opendkim-testkey needs pthreads

From: Daniel Black <>
Date: Fri, 21 Mar 2014 08:35:26 +1100

On 20/03/14 15:22, Murray S. Kucherawy wrote:
> On Thu, 20 Mar 2014, Daniel Black wrote:
>> fedora-19 compile failure:
> Try

I was building off the develop branch. Nothing has changed.

libtool: link: gcc -std=gnu99 -pthread -g -O2 -pthread -o
.libs/opendkim-genzone opendkim_genzone-config.o
opendkim_genzone-opendkim-db.o opendkim_genzone-opendkim-genzone.o
opendkim_genzone-opendkim-lua.o opendkim_genzone-util.o -L/usr/lib
../libopendkim/.libs/ -lresolv -lssl -lcrypto -llua -lm
-ldl -lbsd -pthread -Wl,-rpath -Wl,/usr/local/lib
/usr/bin/ld: opendkim_testkey-opendkim-crypto.o: undefined reference to
symbol 'pthread_setspecific_at__at_GLIBC_2.2.5'
/usr/bin/ld: note: 'pthread_setspecific_at__at_GLIBC_2.2.5' is defined in DSO
/lib64/ so try adding it to the linker command line
/lib64/ could not read symbols: Invalid operation
collect2: error: ld returned 1 exit status
make[3]: *** [opendkim-testkey] Error 1
make[3]: *** Waiting for unfinished jobs....
mv -f .deps/opendkim-opendkim.Tpo .deps/opendkim-opendkim.Po
make[3]: Leaving directory `/tmp/opendkim-2.9.2/opendkim'
make[2]: *** [all-recursive] Error 1
make[2]: Leaving directory `/tmp/opendkim-2.9.2/opendkim'
make[1]: *** [all-recursive] Error 1
make[1]: Leaving directory `/tmp/opendkim-2.9.2'

Received on Thu Mar 20 2014 - 21:36:14 PST

This archive was generated by hypermail 2.3.0 : Thu Mar 20 2014 - 21:45:01 PST